Reaction Details
TargetBifunctional dihydrofolate reductase-thymidylate synthase
LigandBDBM18778
Substrate/Competitorn/a
Meas. Tech.ChEMBL_55400 (CHEMBL668409)
Ki 27.4±n/a nM
Citation Tarnchompoo, BSirichaiwat, CPhupong, WIntaraudom, CSirawaraporn, WKamchonwongpaisan, SVanichtanankul, JThebtaranonth, YYuthavong, Y Development of 2,4-diaminopyrimidines as antimalarials based on inhibition of the S108N and C59R+S108N mutants of dihydrofolate reductase from pyrimethamine-resistant Plasmodium falciparum. J Med Chem45:1244-52 (2002) Bifunctional dihydrofolate reductase-thymidylate synthase
Name:Bifunctional dihydrofolate reductase-thymidylate synthase
Type:Enzyme
Mol. Mass.:71822.51
Organism:Plasmodium falciparum (isolate K1 / Thailand)
Description:The mutant clone was prepared by cassette mutagenesis using wildtype pfDHFR as a template, and expressed in E. coli.
Residue:608
BDBM18778
NameBDBM18778
Synonyms:CHEMBL22405 methyl 4-[2,6-diamino-5-(4-chlorophenyl)pyrimidin-4-yl]butanoate
TypeSmall organic molecule
Emp. Form.C15H17ClN4O2
Mol. Mass.320.774
SMILESCOC(=O)CCCc1nc(N)nc(N)c1-c1ccc(Cl)cc1