Reaction Details
TargetBifunctional dihydrofolate reductase-thymidylate synthase
LigandBDBM18775
Substrate/Competitorn/a
Meas. Tech.ChEMBL_55402 (CHEMBL668411)
Ki 2±n/a nM
Citation Tarnchompoo, BSirichaiwat, CPhupong, WIntaraudom, CSirawaraporn, WKamchonwongpaisan, SVanichtanankul, JThebtaranonth, YYuthavong, Y Development of 2,4-diaminopyrimidines as antimalarials based on inhibition of the S108N and C59R+S108N mutants of dihydrofolate reductase from pyrimethamine-resistant Plasmodium falciparum. J Med Chem45:1244-52 (2002) Bifunctional dihydrofolate reductase-thymidylate synthase
Name:Bifunctional dihydrofolate reductase-thymidylate synthase
Type:Enzyme
Mol. Mass.:71822.51
Organism:Plasmodium falciparum (isolate K1 / Thailand)
Description:The mutant clone was prepared by cassette mutagenesis using wildtype pfDHFR as a template, and expressed in E. coli.
Residue:608
BDBM18775
NameBDBM18775
Synonyms:5-(4-chlorophenyl)-6-methylpyrimidine-2,4-diamine P37
TypeSmall organic molecule
Emp. Form.C11H11ClN4
Mol. Mass.234.685
SMILESCc1nc(N)nc(N)c1-c1ccc(Cl)cc1