Reaction Details
TargetSodium-dependent serotonin transporter
LigandBDBM50073438
Substrate/Competitorn/a
Meas. Tech.ChEMBL_226364 (CHEMBL847532)
Ki 1.92±n/a nM
Citation Emond, PVercouillie, JInnis, RChalon, SMavel, SFrangin, YHalldin, CBesnard, JCGuilloteau, D Substituted diphenyl sulfides as selective serotonin transporter ligands: synthesis and in vitro evaluation. J Med Chem45:1253-8 (2002) Sodium-dependent serotonin transporter
Name:Sodium-dependent serotonin transporter
Type:Multi-pass membrane protein
Mol. Mass.:70168.43
Organism:Rattus norvegicus (rat)
Description:P31652
Residue:630
BDBM50073438
NameBDBM50073438
Synonyms:CHEMBL278165 | [5-Bromo-2-(2-dimethylaminomethyl-phenylsulfanyl)-phenyl]-methanol
TypeSmall organic molecule
Emp. Form.C16H18BrNOS
Mol. Mass.352.289
SMILESCN(C)Cc1ccccc1Sc1ccc(Br)cc1CO