Reaction Details
TargetTransporter
LigandBDBM50073438
Substrate/Competitorn/a
Meas. Tech.ChEMBL_142783 (CHEMBL752158)
Ki 5.8±n/a nM
Citation Emond, PVercouillie, JInnis, RChalon, SMavel, SFrangin, YHalldin, CBesnard, JCGuilloteau, D Substituted diphenyl sulfides as selective serotonin transporter ligands: synthesis and in vitro evaluation. J Med Chem45:1253-8 (2002) Transporter
Name:Transporter
Type:PROTEIN
Mol. Mass.:66787.87
Organism:Rattus norvegicus
Description:ChEMBL_1463061
Residue:597
BDBM50073438
NameBDBM50073438
Synonyms:CHEMBL278165 | [5-Bromo-2-(2-dimethylaminomethyl-phenylsulfanyl)-phenyl]-methanol
TypeSmall organic molecule
Emp. Form.C16H18BrNOS
Mol. Mass.352.289
SMILESCN(C)Cc1ccccc1Sc1ccc(Br)cc1CO