Reaction Details
TargetTransporter
LigandBDBM50110783
Substrate/Competitorn/a
Meas. Tech.ChEMBL_142783 (CHEMBL752158)
Ki 28.4±n/a nM
Citation Emond, PVercouillie, JInnis, RChalon, SMavel, SFrangin, YHalldin, CBesnard, JCGuilloteau, D Substituted diphenyl sulfides as selective serotonin transporter ligands: synthesis and in vitro evaluation. J Med Chem45:1253-8 (2002) Transporter
Name:Transporter
Type:PROTEIN
Mol. Mass.:66787.87
Organism:Rattus norvegicus
Description:ChEMBL_1463061
Residue:597
BDBM50110783
NameBDBM50110783
Synonyms:CHEMBL22743 | [2-(2-Dimethylaminomethyl-phenylsulfanyl)-5-fluoro-phenyl]-methanol
TypeSmall organic molecule
Emp. Form.C16H18FNOS
Mol. Mass.291.384
SMILESCN(C)Cc1ccccc1Sc1ccc(F)cc1CO