Reaction Details
TargetSodium-dependent serotonin transporter
LigandBDBM50110784
Substrate/Competitorn/a
Meas. Tech.ChEMBL_226364 (CHEMBL847532)
Ki 2.5±n/a nM
Citation Emond, PVercouillie, JInnis, RChalon, SMavel, SFrangin, YHalldin, CBesnard, JCGuilloteau, D Substituted diphenyl sulfides as selective serotonin transporter ligands: synthesis and in vitro evaluation. J Med Chem45:1253-8 (2002) Sodium-dependent serotonin transporter
Name:Sodium-dependent serotonin transporter
Type:Multi-pass membrane protein
Mol. Mass.:70168.43
Organism:Rattus norvegicus (rat)
Description:P31652
Residue:630
BDBM50110784
NameBDBM50110784
Synonyms:CHEMBL284002 | [2-(4-Iodo-2-methoxymethyl-phenylsulfanyl)-benzyl]-dimethyl-amine
TypeSmall organic molecule
Emp. Form.C17H20INOS
Mol. Mass.413.316
SMILESCOCc1cc(I)ccc1Sc1ccccc1CN(C)C