Reaction Details
TargetSodium-dependent dopamine transporter
LigandBDBM50110577
Substrate/Competitorn/a
Meas. Tech.ChEMBL_62957 (CHEMBL675677)
Ki>1000±n/a nM
Citation Emond, PVercouillie, JInnis, RChalon, SMavel, SFrangin, YHalldin, CBesnard, JCGuilloteau, D Substituted diphenyl sulfides as selective serotonin transporter ligands: synthesis and in vitro evaluation. J Med Chem45:1253-8 (2002) Sodium-dependent dopamine transporter
Name:Sodium-dependent dopamine transporter
Type:Multi-pass membrane protein
Mol. Mass.:68749.45
Organism:Rattus norvegicus (rat)
Description:P23977
Residue:619
BDBM50110577
NameBDBM50110577
Synonyms:2-(2-((dimethylamino)methyl)phenylthio)-5-iodoaniline CHEMBL23034 | CHEMBL2314218
TypeSmall organic molecule
Emp. Form.C15H17IN2S
Mol. Mass.384.278
SMILESCN(C)Cc1ccccc1Sc1ccc(I)cc1N