Reaction Details
TargetReverse transcriptase/RNaseH
LigandBDBM50110796
Substrate/Competitorn/a
Meas. Tech.ChEMBL_195083 (CHEMBL797537)
IC50 200±n/a nM
Citation Khandazhinskaya, ALShirokova, EASkoblov, YSVictorova, LSGoryunova, LYBeabealashvilli, RSPronyaeva, TRFedyuk, NVZolin, VVPokrovsky, AGKukhanova, MK Carbocyclic dinucleoside polyphosphonates: interaction with HIV reverse transcriptase and antiviral activity. J Med Chem45:1284-91 (2002) Reverse transcriptase/RNaseH
Name:Reverse transcriptase/RNaseH
Type:PROTEIN
Mol. Mass.:65229.15
Organism:Human immunodeficiency virus 1
Description:ChEMBL_1473730
Residue:566
BDBM50110796
NameBDBM50110796
Synonyms:(4-(6-amino-9H-purin-9-yl)cyclopent-2-enyloxy)methylphosphonic diphosphoric anhydride CHEMBL281913
TypeSmall organic molecule
Emp. Form.C11H16N5O10P3
Mol. Mass.471.1935
SMILESNc1ncnc2n(cnc12)C1CC(OCP(O)(=O)OP(O)(=O)OP(O)(O)=O)C=C1