Reaction Details
TargetReverse transcriptase/RNaseH
LigandBDBM50110801
Substrate/Competitorn/a
Meas. Tech.ChEMBL_195083 (CHEMBL797537)
IC50 700±n/a nM
Citation Khandazhinskaya, ALShirokova, EASkoblov, YSVictorova, LSGoryunova, LYBeabealashvilli, RSPronyaeva, TRFedyuk, NVZolin, VVPokrovsky, AGKukhanova, MK Carbocyclic dinucleoside polyphosphonates: interaction with HIV reverse transcriptase and antiviral activity. J Med Chem45:1284-91 (2002) Reverse transcriptase/RNaseH
Name:Reverse transcriptase/RNaseH
Type:PROTEIN
Mol. Mass.:65229.15
Organism:Human immunodeficiency virus 1
Description:ChEMBL_1473730
Residue:566
BDBM50110801
NameBDBM50110801
Synonyms:CHEMBL23361 | P,P'-Bis {[4-(guanine-9-yl)cyclopent-2-enyl]oxy-methylphosphonyl}diphosphate
TypeSmall organic molecule
Emp. Form.C22H28N10O15P4
Mol. Mass.796.4108
SMILESNc1nc2n(cnc2c(=O)[nH]1)C1CC(OCP(O)(=O)OP(O)(=O)OP(O)(=O)OP(O)(=O)COC2CC(C=C2)n2cnc3c2nc(N)[nH]c3=O)C=C1