Reaction Details
TargetCytosolic phospholipase A2 beta
LigandBDBM50110879
Substrate/Competitorn/a
Meas. Tech.ChEMBL_156210 (CHEMBL767152)
IC50 48±n/a nM
Citation Connolly, SBennion, CBotterell, SCroshaw, PJHallam, CHardy, KHartopp, PJackson, CGKing, SJLawrence, LMete, AMurray, DRobinson, DHSmith, GMStein, LWalters, IWells, EWithnall, WJ Design and synthesis of a novel and potent series of inhibitors of cytosolic phospholipase A(2) based on a 1,3-disubstituted propan-2-one skeleton. J Med Chem45:1348-62 (2002) Cytosolic phospholipase A2 beta
Name:Cytosolic phospholipase A2 beta
Type:PROTEIN
Mol. Mass.:87967.69
Organism:Homo sapiens (Human)
Description:ChEMBL_156210
Residue:781
BDBM50110879
NameBDBM50110879
Synonyms:4-{2-Oxo-3-[4-(5-phenyl-pentyloxy)-phenoxy]-propoxy}-benzoic acid | CHEMBL30130
TypeSmall organic molecule
Emp. Form.C27H28O6
Mol. Mass.448.5076
SMILESOC(=O)c1ccc(OCC(=O)COc2ccc(OCCCCCc3ccccc3)cc2)cc1