Reaction Details
TargetGenome polyprotein
LigandBDBM50111075
Substrate/Competitorn/a
Meas. Tech.ChEMBL_143619 (CHEMBL751828)
Ki 8000±n/a nM
Citation Zhang, RDurkin, JPWindsor, WT Azapeptides as inhibitors of the hepatitis C virus NS3 serine protease. Bioorg Med Chem Lett12:1005-8 (2002) Genome polyprotein
Name:Genome polyprotein
Type:Protein
Mol. Mass.:67067.41
Organism:Hepatitis C virus
Description:A3EZI9
Residue:631
BDBM50111075
NameBDBM50111075
Synonyms:Azapeptide | CHEMBL6738
TypeSmall organic molecule
Emp. Form.C40H59N9O16
Mol. Mass.921.9472
SMILESCCCN(NC(=O)[C@H]1CCCN1C(=O)[C@@H](NC(=O)[C@@H](NC(=O)[C@H](CC(O)=O)NC(=O)[C@H](CCC(O)=O)NC(=O)[C@@H](NC(C)=O)[C@@H](C)O)C(C)C)C(C)C)C(=O)Oc1ccc(cc1)[N+]([O-])=O