Reaction Details
TargetGenome polyprotein
LigandBDBM50111051
Substrate/Competitorn/a
Meas. Tech.ChEBML_143619
Ki 9000±n/a nM
Citation Zhang, RDurkin, JPWindsor, WT Azapeptides as inhibitors of the hepatitis C virus NS3 serine protease. Bioorg Med Chem Lett12:1005-8 (2002) Genome polyprotein
Name:Genome polyprotein
Type:Protein
Mol. Mass.:67067.41
Organism:Hepatitis C virus
Description:A3EZI9
Residue:631
BDBM50111051
NameBDBM50111051
Synonyms:Azapeptide | CHEMBL387089
TypeSmall organic molecule
Emp. Form.C44H64N10O19
Mol. Mass.1037.0346
SMILESCCCN(NC(=O)[C@H]1CCCN1C(=O)[C@@H](NC(=O)[C@@H](NC(=O)[C@H](CC(O)=O)NC(=O)[C@H](CCC(O)=O)NC(=O)[C@@H](NC(=O)[C@H](CC(O)=O)NC(C)=O)[C@@H](C)O)C(C)C)C(C)C)C(=O)Oc1ccccc1[N+]([O-])=O