Reaction Details
TargetPlasminogen activator inhibitor 1
LigandBDBM50111273
Substrate/Competitorn/a
Meas. Tech.ChEMBL_222792 (CHEMBL847120)
IC50 290±n/a nM
Citation Folkes, ABrown, SDCanne, LEChan, JEngelhardt, EEpshteyn, SFaint, RGolec, JHanel, AKearney, PLeahy, JWMac, MMatthews, DPrisbylla, MPSanderson, JSimon, RJTesfai, ZVicker, NWang, SWebb, RRCharlton, P Design, synthesis and in vitro evaluation of potent, novel, small molecule inhibitors of plasminogen activator inhibitor-1. Bioorg Med Chem Lett12:1063-6 (2002) Plasminogen activator inhibitor 1
Name:Plasminogen activator inhibitor 1
Type:Enzyme
Mol. Mass.:45064.00
Organism:Homo sapiens (Human)
Description:P05121
Residue:402
BDBM50111273
NameBDBM50111273
Synonyms:6-Benzo[b]thiophen-2-yl-4-hydroxy-2-oxo-1,2-dihydro-quinoline-3-carboxylic acid [4-(7-tetrazol-1-yl-heptyloxy)-phenyl]-amide | CHEMBL10004
TypeSmall organic molecule
Emp. Form.C32H30N6O4S
Mol. Mass.594.683
SMILESOc1c(C(=O)Nc2ccc(OCCCCCCCn3cnnn3)cc2)c(=O)[nH]c2ccc(cc12)-c1cc2ccccc2s1