Reaction Details
TargetPlasminogen activator inhibitor 1
LigandBDBM50111280
Substrate/Competitorn/a
Meas. Tech.ChEMBL_222792 (CHEMBL847120)
IC50 300±n/a nM
Citation Folkes, ABrown, SDCanne, LEChan, JEngelhardt, EEpshteyn, SFaint, RGolec, JHanel, AKearney, PLeahy, JWMac, MMatthews, DPrisbylla, MPSanderson, JSimon, RJTesfai, ZVicker, NWang, SWebb, RRCharlton, P Design, synthesis and in vitro evaluation of potent, novel, small molecule inhibitors of plasminogen activator inhibitor-1. Bioorg Med Chem Lett12:1063-6 (2002) Plasminogen activator inhibitor 1
Name:Plasminogen activator inhibitor 1
Type:Enzyme
Mol. Mass.:45064.00
Organism:Homo sapiens (Human)
Description:P05121
Residue:402
BDBM50111280
NameBDBM50111280
Synonyms:1-(4-Chloro-phenyl)-4-hydroxy-2-oxo-2,5-dihydro-1H-pyrrole-3-carboxylic acid [4-(7-tetrazol-1-yl-heptyloxy)-phenyl]-amide | CHEMBL275779
TypeSmall organic molecule
Emp. Form.C25H27ClN6O4
Mol. Mass.510.973
SMILESClc1ccc(cc1)N1CC(=O)C(C(=O)Nc2ccc(OCCCCCCCn3cnnn3)cc2)C1=O