Reaction Details
TargetTelomerase reverse transcriptase
LigandBDBM50111322
Substrate/Competitorn/a
Meas. Tech.ChEBML_210224
IC50 500±n/a nM
Citation Alberti, PSchmitt, PNguyen, CHRivalle, CHoarau, MGrierson, DSMergny, JL Benzoindoloquinolines interact with DNA tetraplexes and inhibit telomerase. Bioorg Med Chem Lett12:1071-4 (2002) Telomerase reverse transcriptase
Name:Telomerase reverse transcriptase
Type:PROTEIN
Mol. Mass.:127099.03
Organism:Homo sapiens (Human)
Description:ChEMBL_1447029
Residue:1132
BDBM50111322
NameBDBM50111322
Synonyms:CHEMBL274335 | N,N-Dimethyl-N'-(11-nitro-13H-5,13-diaza-dibenzo[a,i]fluoren-6-yl)-propane-1,3-diamine
TypeSmall organic molecule
Emp. Form.C24H23N5O2
Mol. Mass.413.4717
SMILESCN(C)CCCNc1nc2ccccc2c2[nH]c3c(ccc4ccc(cc34)[N+]([O-])=O)c12