Reaction Details
TargetDNA polymerase I, thermostable
LigandBDBM50111320
Substrate/Competitorn/a
Meas. Tech.ChEBML_209735
IC50 900±n/a nM
Citation Alberti, PSchmitt, PNguyen, CHRivalle, CHoarau, MGrierson, DSMergny, JL Benzoindoloquinolines interact with DNA tetraplexes and inhibit telomerase. Bioorg Med Chem Lett12:1071-4 (2002) DNA polymerase I, thermostable
Name:DNA polymerase I, thermostable
Type:PROTEIN
Mol. Mass.:93906.95
Organism:Thermus aquaticus
Description:ChEMBL_1289218
Residue:832
BDBM50111320
NameBDBM50111320
Synonyms:CHEMBL274096 | N'-(10-Methoxy-13H-5,13-diaza-dibenzo[a,i]fluoren-6-yl)-N,N-dimethyl-propane-1,3-diamine
TypeSmall organic molecule
Emp. Form.C25H26N4O
Mol. Mass.398.5001
SMILESCOc1ccc2c3[nH]c4c(c(NCCCN(C)C)nc5ccccc45)c3ccc2c1