Reaction Details
TargetMuscarinic acetylcholine receptor M2
LigandBDBM50111353
Substrate/Competitorn/a
Meas. Tech.ChEBML_139766
Ki 2.7±n/a nM
Citation Wang, YChackalamannil, SHu, ZMcKittrick, BAGreenlee, WRuperto, VDuffy, RALachowicz, JE Sulfide analogues as potent and selective M(2) muscarinic receptor antagonists. Bioorg Med Chem Lett12:1087-91 (2002) Muscarinic acetylcholine receptor M2
Name:Muscarinic acetylcholine receptor M2
Type:GPCR
Mol. Mass.:51730.61
Organism:Homo sapiens (Human)
Description:P08172
Residue:466
BDBM50111353
NameBDBM50111353
Synonyms:CHEMBL418530 | {4-[1'-(6-Ethoxy-naphthalene-1-carbonyl)-[1,4']bipiperidinyl-4-ylmethyl]-phenylsulfanyl}-acetic acid ethyl ester
TypeSmall organic molecule
Emp. Form.C34H42N2O4S
Mol. Mass.574.773
SMILESCCOC(=O)CSc1ccc(CC2CCN(CC2)C2CCN(CC2)C(=O)c2cccc3cc(OCC)ccc23)cc1