Reaction Details
TargetIntegrin alpha-IIb/beta-3
LigandBDBM50111398
Substrate/Competitorn/a
Meas. Tech.ChEMBL_70186 (CHEMBL684374)
IC50 2±n/a nM
Citation Mehrotra, MMHeath, JARose, JWSmyth, MSSeroogy, JVolkots, DLRuhter, GSchotten, TAlaimo, LPark, GPandey, AScarborough, RM Spirocyclic nonpeptide glycoprotein IIb-IIIa antagonists. Part 3: synthesis and SAR of potent and specific 2,8-diazaspiro[4.5]decanes. Bioorg Med Chem Lett12:1103-7 (2002) Integrin alpha-IIb/beta-3
Name:Integrin alpha-IIb/beta-3
Synonyms:Glycoprotein IIb/IIIa
Type:n/a
Mol. Mass.:n/a
Description:ASSAY_ID of EBI is 30109
Components:This complex has 2 components.
Component 1
Name:Integrin beta-3
Type:Protein
Mol. Mass.:87038.91
Organism:Homo sapiens (Human)
Description:P05106
Residue:788
Component 2
Name:Integrin alpha-IIb
Synonyms:CD_antigen=CD41 GPIIb Glycoprotein IIb ITGA2B Integrin alpha-IIb heavy chain Integrin alpha-IIb light chain, form 2 Integrin alpha-V/beta-3 and alpha-IIb/beta 3 | Platelet membrane glycoprotein IIb
Type:Protein
Mol. Mass.:113354.85
Organism:Homo sapiens (Human)
Description:P08514
Residue:1039
BDBM50111398
NameBDBM50111398
Synonyms:(S)-2-(Isoxazole-4-sulfonylamino)-5-oxo-5-(2-pyridin-4-yl-2,8-diaza-spiro[4.5]dec-8-yl)-pentanoic acid | CHEMBL268922
TypeSmall organic molecule
Emp. Form.C21H27N5O6S
Mol. Mass.477.534
SMILESOC(=O)[C@H](CCC(=O)N1CCC2(CCN(C2)c2ccncc2)CC1)NS(=O)(=O)c1cnoc1