Reaction Details
TargetCyclin-dependent kinase 5 activator 1
LigandBDBM50111433
Substrate/Competitorn/a
Meas. Tech.ChEMBL_51325 (CHEMBL663604)
IC50>1200000±n/a nM
Citation Song, YWang, JTeng, SFKesuma, DDeng, YDuan, JWang, JHQi, RZSim, MM Beta-carbolines as specific inhibitors of cyclin-dependent kinases. Bioorg Med Chem Lett12:1129-32 (2002) Cyclin-dependent kinase 5 activator 1
Name:Cyclin-dependent kinase 5 activator 1
Type:Protein Complex
Mol. Mass.:n/a
Description:n/a
Components:This complex has 2 components.
Component 1
Name:Cyclin-dependent kinase 5
Synonyms:CDK5 CDKN5 Cyclin-dependent kinase 5 (CDK5/ p25) Cyclin-dependent-like kinase 5 PSSALRE Tau protein kinase II catalytic subunit
Type:Enzyme Subunit
Mol. Mass.:33308.61
Organism:Homo sapiens (Human)
Description:n/a
Residue:292
Component 2
Name:Cyclin-dependent kinase 5 activator 1
Synonyms:CD5R1_HUMAN CDK5R1 Cyclin-dependent kinase 5 (CDK5/p25) NCK5A p35
Type:Enzyme Subunit
Mol. Mass.:34077.43
Organism:Homo sapiens (Human)
Description:Q15078
Residue:307
BDBM50111433
NameBDBM50111433
Synonyms:1-(2-Chloro-5-nitro-phenyl)-9H-beta-carboline | CHEMBL14217
TypeSmall organic molecule
Emp. Form.C17H10ClN3O2
Mol. Mass.323.733
SMILES[O-][N+](=O)c1ccc(Cl)c(c1)-c1nccc2c1[nH]c1ccccc21