Reaction Details
TargetTyrosine-protein kinase Fyn
LigandBDBM50111435
Substrate/Competitorn/a
Meas. Tech.ChEBML_69438
IC50>250000±n/a nM
Citation Song, YWang, JTeng, SFKesuma, DDeng, YDuan, JWang, JHQi, RZSim, MM Beta-carbolines as specific inhibitors of cyclin-dependent kinases. Bioorg Med Chem Lett12:1129-32 (2002) Tyrosine-protein kinase Fyn
Name:Tyrosine-protein kinase Fyn
Type:Enzyme
Mol. Mass.:60762.21
Organism:Homo sapiens (Human)
Description:P06241
Residue:537
BDBM50111435
NameBDBM50111435
Synonyms:7-Fluoro-1-methyl-9H-beta-carboline | CHEMBL14445
TypeSmall organic molecule
Emp. Form.C12H9FN2
Mol. Mass.200.2117
SMILESCc1nccc2c3ccc(F)cc3[nH]c12