Reaction Details
Target5-hydroxytryptamine receptor 2A
LigandBDBM10758
Substrate/Competitorn/a
Meas. Tech.ChEMBL_2455 (CHEMBL617344)
Ki 16800±n/a nM
Citation Runyon, SPPeddi, SSavage, JERoth, BLGlennon, RAWestkaemper, RB Geometry-affinity relationships of the selective serotonin receptor ligand 9-(aminomethyl)-9,10-dihydroanthracene. J Med Chem45:1656-64 (2002) 5-hydroxytryptamine receptor 2A
Name:5-hydroxytryptamine receptor 2A
Type:undefined
Mol. Mass.:52607.65
Organism:Homo sapiens (Human)
Description:P28223
Residue:471
BDBM10758
NameBDBM10758
Synonyms:14C-phenylethylamine CHEMBL610 | phenylethylamine
TypeSmall organic molecule
Emp. Form.C8H11N
Mol. Mass.121.1796
SMILESNCCc1ccccc1