Reaction Details
TargetDihydrofolate reductase
LigandBDBM50111548
Substrate/Competitorn/a
Meas. Tech.ChEMBL_54285 (CHEMBL666804)
Ki 0.0006±n/a nM
Citation Vaidya, CMWright, JERosowsky, A Synthesis and in vitro antitumor activity of new deaza analogues of the nonpolyglutamatable antifolate N(alpha)-(4-amino-4-deoxypteroyl)-N(delta)-hemiphthaloyl-L-ornithine (PT523). J Med Chem45:1690-6 (2002) Dihydrofolate reductase
Name:Dihydrofolate reductase
Type:Enzyme
Mol. Mass.:21453.99
Organism:Homo sapiens (Human)
Description:Recombinant human DHFR.
Residue:187
BDBM50111548
NameBDBM50111548
Synonyms:CHEMBL47919 | N-(4-Carboxy-4-{4-[1-(6,8-diamino-quinoxalin-2-ylmethyl)-but-3-ynyl]-benzoylamino}-butyl)-phthalamic acid
TypeSmall organic molecule
Emp. Form.C33H32N6O6
Mol. Mass.608.6438
SMILESNc1cc(N)c2nc(CC(CC#C)c3ccc(cc3)C(=O)NC(CCCNC(=O)c3ccccc3C(O)=O)C(O)=O)cnc2c1