Reaction Details
TargetDihydrofolate reductase
LigandBDBM50111551
Substrate/Competitorn/a
Meas. Tech.ChEMBL_54285 (CHEMBL666804)
Ki 0.00062±n/a nM
Citation Vaidya, CMWright, JERosowsky, A Synthesis and in vitro antitumor activity of new deaza analogues of the nonpolyglutamatable antifolate N(alpha)-(4-amino-4-deoxypteroyl)-N(delta)-hemiphthaloyl-L-ornithine (PT523). J Med Chem45:1690-6 (2002) Dihydrofolate reductase
Name:Dihydrofolate reductase
Type:Enzyme
Mol. Mass.:21453.99
Organism:Homo sapiens (Human)
Description:Recombinant human DHFR.
Residue:187
BDBM50111551
NameBDBM50111551
Synonyms:CHEMBL295859 | N-(4-Carboxy-4-{4-[1-(6,8-diamino-quinoxalin-2-ylmethyl)-propyl]-benzoylamino}-butyl)-phthalamic acid
TypeSmall organic molecule
Emp. Form.C32H34N6O6
Mol. Mass.598.649
SMILESCCC(Cc1cnc2cc(N)cc(N)c2n1)c1ccc(cc1)C(=O)NC(CCCNC(=O)c1ccccc1C(O)=O)C(O)=O