Reaction Details
TargetDioxygenase
LigandBDBM50111618
Substrate/Competitorn/a
Meas. Tech.ChEMBL_100831 (CHEMBL709763)
IC50 12000±n/a nM
Citation Han, SInoue, HTerada, TKamoda, SSaburi, YSekimata, KSaito, TKobayashi, MShinozaki, KYoshida, SAsami, T Design and synthesis of lignostilbene-alpha,beta-dioxygenase inhibitors. Bioorg Med Chem Lett12:1139-42 (2002) Dioxygenase
Name:Dioxygenase
Synonyms:Lignostilbene alpha, beta-dioxygenase
Type:PROTEIN
Mol. Mass.:14181.67
Organism:Pseudomonas paucimobilis
Description:ChEMBL_19606
Residue:128
BDBM50111618
NameBDBM50111618
TypeSmall organic molecule
Emp. Form.C9H10O
Mol. Mass.134.1751
SMILESCC(=C)c1ccc(O)cc1