Reaction Details
TargetSigma non-opioid intracellular receptor 1
LigandBDBM50111630
Substrate/Competitorn/a
Meas. Tech.ChEBML_201567
Ki 5±n/a nM
Citation Mouithys-Mickalad, APoupaert, JHSpampinato, SLesieur, D Synthesis and pharmacological evaluation of 6-piperidino- and 6-piperazinoalkyl-2(3H)-benzothiazolones as mixed sigma/5-HT(1A) ligands. Bioorg Med Chem Lett12:1149-52 (2002) Sigma non-opioid intracellular receptor 1
Name:Sigma non-opioid intracellular receptor 1
Type:Enzyme Catalytic Domain
Mol. Mass.:25124.85
Organism:Homo sapiens (Human)
Description:Q99720
Residue:223
BDBM50111630
NameBDBM50111630
Synonyms:6-[4-(4-Benzyl-piperidin-1-yl)-butyl]-3-methyl-3H-benzothiazol-2-one | CHEMBL16123
TypeSmall organic molecule
Emp. Form.C24H30N2OS
Mol. Mass.394.573
SMILESCn1c2ccc(CCCCN3CCC(Cc4ccccc4)CC3)cc2sc1=O