Reaction Details
Target5-hydroxytryptamine receptor 1A
LigandBDBM50111628
Substrate/Competitorn/a
Meas. Tech.ChEBML_1161
Ki 300±n/a nM
Citation Mouithys-Mickalad, APoupaert, JHSpampinato, SLesieur, D Synthesis and pharmacological evaluation of 6-piperidino- and 6-piperazinoalkyl-2(3H)-benzothiazolones as mixed sigma/5-HT(1A) ligands. Bioorg Med Chem Lett12:1149-52 (2002) 5-hydroxytryptamine receptor 1A
Name:5-hydroxytryptamine receptor 1A
Type:G Protein-Coupled Receptor (GPCR)
Mol. Mass.:46445.29
Organism:Rattus norvegicus (rat)
Description:Binding assays were performed using rat hippocampal membranes.
Residue:422
BDBM50111628
NameBDBM50111628
Synonyms:6-{4-[4-(3,4-Dichloro-benzyl)-piperazin-1-yl]-butyl}-3-methyl-3H-benzothiazol-2-one | CHEMBL15456
TypeSmall organic molecule
Emp. Form.C23H27Cl2N3OS
Mol. Mass.464.451
SMILESCn1c2ccc(CCCCN3CCN(Cc4ccc(Cl)c(Cl)c4)CC3)cc2sc1=O