Reaction Details
TargetD(2) dopamine receptor
LigandBDBM50111631
Substrate/Competitorn/a
Meas. Tech.ChEBML_62561
Ki>100±n/a nM
Citation Mouithys-Mickalad, APoupaert, JHSpampinato, SLesieur, D Synthesis and pharmacological evaluation of 6-piperidino- and 6-piperazinoalkyl-2(3H)-benzothiazolones as mixed sigma/5-HT(1A) ligands. Bioorg Med Chem Lett12:1149-52 (2002) D(2) dopamine receptor
Name:D(2) dopamine receptor
Type:G Protein-Coupled Receptor (GPCR)
Mol. Mass.:50931.60
Organism:Rattus norvegicus (rat)
Description:P61169
Residue:444
BDBM50111631
NameBDBM50111631
Synonyms:6-[2-(4-Benzyl-piperidin-1-yl)-ethyl]-3-methyl-3H-benzothiazol-2-one | CHEMBL15809
TypeSmall organic molecule
Emp. Form.C22H26N2OS
Mol. Mass.366.52
SMILESCn1c2ccc(CCN3CCC(Cc4ccccc4)CC3)cc2sc1=O