Reaction Details
TargetSigma non-opioid intracellular receptor 1
LigandBDBM50111634
Substrate/Competitorn/a
Meas. Tech.ChEBML_201567
Ki 5±n/a nM
Citation Mouithys-Mickalad, APoupaert, JHSpampinato, SLesieur, D Synthesis and pharmacological evaluation of 6-piperidino- and 6-piperazinoalkyl-2(3H)-benzothiazolones as mixed sigma/5-HT(1A) ligands. Bioorg Med Chem Lett12:1149-52 (2002) Sigma non-opioid intracellular receptor 1
Name:Sigma non-opioid intracellular receptor 1
Type:Enzyme Catalytic Domain
Mol. Mass.:25124.85
Organism:Homo sapiens (Human)
Description:Q99720
Residue:223
BDBM50111634
NameBDBM50111634
Synonyms:6-{2-[4-(3,4-Dichloro-benzyl)-piperazin-1-yl]-ethyl}-3-methyl-3H-benzothiazol-2-one | CHEMBL15601
TypeSmall organic molecule
Emp. Form.C21H23Cl2N3OS
Mol. Mass.436.398
SMILESCn1c2ccc(CCN3CCN(Cc4ccc(Cl)c(Cl)c4)CC3)cc2sc1=O