Reaction Details
TargetHistamine H1 receptor
LigandBDBM50111633
Substrate/Competitorn/a
Meas. Tech.ChEMBL_84709 (CHEMBL694448)
Ki<100±n/a nM
Citation Mouithys-Mickalad, APoupaert, JHSpampinato, SLesieur, D Synthesis and pharmacological evaluation of 6-piperidino- and 6-piperazinoalkyl-2(3H)-benzothiazolones as mixed sigma/5-HT(1A) ligands. Bioorg Med Chem Lett12:1149-52 (2002) Histamine H1 receptor
Name:Histamine H1 receptor
Type:Enzyme Catalytic Domain
Mol. Mass.:55716.35
Organism:RAT
Description:HISTAMINE H1 HRH1 RAT::P31390
Residue:486
BDBM50111633
NameBDBM50111633
Synonyms:6-{4-[4-(2,4-Dichloro-benzyl)-piperazin-1-yl]-butyl}-3-methyl-3H-benzothiazol-2-one | CHEMBL15637
TypeSmall organic molecule
Emp. Form.C23H27Cl2N3OS
Mol. Mass.464.451
SMILESCn1c2ccc(CCCCN3CCN(Cc4ccc(Cl)cc4Cl)CC3)cc2sc1=O