Reaction Details
TargetAcetylcholine receptor subunit delta
LigandBDBM50094299
Substrate/Competitorn/a
Meas. Tech.ChEMBL_142595 (CHEMBL872438)
IC50 930±n/a nM
Citation Strømgaard, KMellor, IRAndersen, KNeagoe, IPluteanu, FUsherwood, PNKrogsgaard-Larsen, PJaroszewski, JW Solid-phase synthesis and pharmacological evaluation of analogues of PhTX-12-A potent and selective nicotinic acetylcholine receptor antagonist. Bioorg Med Chem Lett12:1159-62 (2002) Acetylcholine receptor subunit delta
Name:Acetylcholine receptor subunit delta
Type:PROTEIN
Mol. Mass.:58894.39
Organism:Homo sapiens (Human)
Description:ChEMBL_142595
Residue:517
BDBM50094299
NameBDBM50094299
Synonyms:CHEMBL15998 N-[1-(12-Amino-dodecylcarbamoyl)-2-(4-hydroxy-phenyl)-ethyl]-butyramide
TypeSmall organic molecule
Emp. Form.C25H43N3O3
Mol. Mass.433.6272
SMILESCCCC(=O)N[C@@H](Cc1ccc(O)cc1)C(=O)NCCCCCCCCCCCCN