Reaction Details
TargetSerine protease 1
LigandBDBM50111718
Substrate/Competitorn/a
Meas. Tech.ChEBML_212857
Ki 31±n/a nM
Citation Reiner, JESiev, DVAraldi, GLCui, JJHo, JZReddy, KMMamedova, LVu, PHLee, KSMinami, NKGibson, TSAnderson, SMBradbury, AENolan, TGSemple, JE Non-covalent thrombin inhibitors featuring P(3)-heterocycles with P(1)-monocyclic arginine surrogates. Bioorg Med Chem Lett12:1203-8 (2002) Serine protease 1
Name:Serine protease 1
Type:Enzyme
Mol. Mass.:26557.80
Organism:Homo sapiens (Human)
Description:P07477
Residue:247
BDBM50111718
NameBDBM50111718
Synonyms:CHEMBL279199 | N-(4-Carbamimidoyl-2-fluoro-benzyl)-2-[3-(3-methoxy-benzenesulfonylamino)-2-oxo-2H-pyridin-1-yl]-acetamide
TypeSmall organic molecule
Emp. Form.C22H22FN5O5S
Mol. Mass.487.504
SMILESCOc1cccc(c1)S(=O)(=O)Nc1cccn(CC(=O)NCc2ccc(cc2F)C(N)=N)c1=O