Reaction Details
TargetProthrombin
LigandBDBM50111724
Substrate/Competitorn/a
Meas. Tech.ChEBML_208494
Ki 0.370000±n/a nM
Citation Reiner, JESiev, DVAraldi, GLCui, JJHo, JZReddy, KMMamedova, LVu, PHLee, KSMinami, NKGibson, TSAnderson, SMBradbury, AENolan, TGSemple, JE Non-covalent thrombin inhibitors featuring P(3)-heterocycles with P(1)-monocyclic arginine surrogates. Bioorg Med Chem Lett12:1203-8 (2002) Prothrombin
Name:Prothrombin
Type:Protein
Mol. Mass.:70029.57
Organism:Homo sapiens (Human)
Description:P00734
Residue:622
BDBM50111724
NameBDBM50111724
Synonyms:CHEMBL19731 | N-(4-Carbamimidoyl-benzyl)-2-(6-methyl-2-oxo-3-phenylmethanesulfonylamino-2H-pyridin-1-yl)-acetamide
TypeSmall organic molecule
Emp. Form.C23H25N5O4S
Mol. Mass.467.541
SMILESCc1ccc(NS(=O)(=O)Cc2ccccc2)c(=O)n1CC(=O)NCc1ccc(cc1)C(N)=N