Reaction Details
TargetProthrombin
LigandBDBM50111725
Substrate/Competitorn/a
Meas. Tech.ChEBML_208494
Ki 5.5±n/a nM
Citation Reiner, JESiev, DVAraldi, GLCui, JJHo, JZReddy, KMMamedova, LVu, PHLee, KSMinami, NKGibson, TSAnderson, SMBradbury, AENolan, TGSemple, JE Non-covalent thrombin inhibitors featuring P(3)-heterocycles with P(1)-monocyclic arginine surrogates. Bioorg Med Chem Lett12:1203-8 (2002) Prothrombin
Name:Prothrombin
Type:Protein
Mol. Mass.:70029.57
Organism:Homo sapiens (Human)
Description:P00734
Residue:622
BDBM50111725
NameBDBM50111725
Synonyms:CHEMBL19689 | N-(5-Amino-pyrazin-2-ylmethyl)-2-(3-{[1-(4-chloro-phenyl)-cyclobutylmethyl]-amino}-6-methyl-2-oxo-2H-pyrazin-1-yl)-acetamide
TypeSmall organic molecule
Emp. Form.C23H26ClN7O2
Mol. Mass.467.951
SMILESCc1cnc(NCC2(CCC2)c2ccc(Cl)cc2)c(=O)n1CC(=O)NCc1cnc(N)cn1