Reaction Details
TargetCoagulation factor X
LigandBDBM50111732
Substrate/Competitorn/a
Meas. Tech.ChEBML_69664
Ki 153±n/a nM
Citation Reiner, JESiev, DVAraldi, GLCui, JJHo, JZReddy, KMMamedova, LVu, PHLee, KSMinami, NKGibson, TSAnderson, SMBradbury, AENolan, TGSemple, JE Non-covalent thrombin inhibitors featuring P(3)-heterocycles with P(1)-monocyclic arginine surrogates. Bioorg Med Chem Lett12:1203-8 (2002) Coagulation factor X
Name:Coagulation factor X
Type:Enzyme
Mol. Mass.:54726.60
Organism:Homo sapiens (Human)
Description:n/a
Residue:488
BDBM50111732
NameBDBM50111732
Synonyms:CHEMBL19453 | N-(4-Carbamimidoyl-benzyl)-2-[3-(3-methoxy-benzenesulfonylamino)-2-oxo-2H-pyridin-1-yl]-acetamide
TypeSmall organic molecule
Emp. Form.C22H23N5O5S
Mol. Mass.469.514
SMILESCOc1cccc(c1)S(=O)(=O)Nc1cccn(CC(=O)NCc2ccc(cc2)C(N)=N)c1=O