Reaction Details
TargetProthrombin
LigandBDBM50111743
Substrate/Competitorn/a
Meas. Tech.ChEBML_208494
Ki 13±n/a nM
Citation Reiner, JESiev, DVAraldi, GLCui, JJHo, JZReddy, KMMamedova, LVu, PHLee, KSMinami, NKGibson, TSAnderson, SMBradbury, AENolan, TGSemple, JE Non-covalent thrombin inhibitors featuring P(3)-heterocycles with P(1)-monocyclic arginine surrogates. Bioorg Med Chem Lett12:1203-8 (2002) Prothrombin
Name:Prothrombin
Type:Protein
Mol. Mass.:70029.57
Organism:Homo sapiens (Human)
Description:P00734
Residue:622
BDBM50111743
NameBDBM50111743
Synonyms:2-(6-Methyl-2-oxo-3-phenethylamino-2H-pyrazin-1-yl)-N-(5-(E)-2-(tert-Butyl-dimethyl-silanyloxy-amidine-thiophen-2-ylmethyl)-acetamide | CHEMBL417457
TypeSmall organic molecule
Emp. Form.C27H38N6O3SSi
Mol. Mass.554.78
SMILESCc1cnc(NCCc2ccccc2)c(=O)n1CC(=O)NCc1ccc(s1)C(N)=NO[Si](C)(C)C(C)(C)C