Reaction Details
TargetSerine protease 1
LigandBDBM50111730
Substrate/Competitorn/a
Meas. Tech.ChEBML_212857
Ki 12±n/a nM
Citation Reiner, JESiev, DVAraldi, GLCui, JJHo, JZReddy, KMMamedova, LVu, PHLee, KSMinami, NKGibson, TSAnderson, SMBradbury, AENolan, TGSemple, JE Non-covalent thrombin inhibitors featuring P(3)-heterocycles with P(1)-monocyclic arginine surrogates. Bioorg Med Chem Lett12:1203-8 (2002) Serine protease 1
Name:Serine protease 1
Type:Enzyme
Mol. Mass.:26557.80
Organism:Homo sapiens (Human)
Description:P07477
Residue:247
BDBM50111730
NameBDBM50111730
Synonyms:2-[3-(2-Fluoro-phenylmethanesulfonylamino)-6-methyl-2-oxo-2H-pyridin-1-yl]-N-((R)-1-formyl-4-guanidino-butyl)-acetamide CVS-2359
TypeSmall organic molecule
Emp. Form.C21H27FN6O6S
Mol. Mass.510.539
SMILESCc1ccc(NS(=O)(=O)Cc2ccccc2F)c(=O)n1CC(=O)N[C@H](CCCNC(N)=N)C(O)=O