Reaction Details
TargetProthrombin
LigandBDBM50111716
Substrate/Competitorn/a
Meas. Tech.ChEBML_208494
Ki 5.9±n/a nM
Citation Reiner, JESiev, DVAraldi, GLCui, JJHo, JZReddy, KMMamedova, LVu, PHLee, KSMinami, NKGibson, TSAnderson, SMBradbury, AENolan, TGSemple, JE Non-covalent thrombin inhibitors featuring P(3)-heterocycles with P(1)-monocyclic arginine surrogates. Bioorg Med Chem Lett12:1203-8 (2002) Prothrombin
Name:Prothrombin
Type:Protein
Mol. Mass.:70029.57
Organism:Homo sapiens (Human)
Description:P00734
Residue:622
BDBM50111716
NameBDBM50111716
Synonyms:CHEMBL19798 | N-(4-Carbamimidoyl-thiazol-2-ylmethyl)-2-[3-(3-methoxy-benzenesulfonylamino)-2-oxo-2H-pyridin-1-yl]-acetamide
TypeSmall organic molecule
Emp. Form.C19H20N6O5S2
Mol. Mass.476.529
SMILESCOc1cccc(c1)S(=O)(=O)Nc1cccn(CC(=O)NCc2nc(cs2)C(N)=N)c1=O