Reaction Details
TargetSerine protease 1
LigandBDBM50111726
Substrate/Competitorn/a
Meas. Tech.ChEBML_212857
Ki 20±n/a nM
Citation Reiner, JESiev, DVAraldi, GLCui, JJHo, JZReddy, KMMamedova, LVu, PHLee, KSMinami, NKGibson, TSAnderson, SMBradbury, AENolan, TGSemple, JE Non-covalent thrombin inhibitors featuring P(3)-heterocycles with P(1)-monocyclic arginine surrogates. Bioorg Med Chem Lett12:1203-8 (2002) Serine protease 1
Name:Serine protease 1
Type:Enzyme
Mol. Mass.:26557.80
Organism:Homo sapiens (Human)
Description:P07477
Residue:247
BDBM50111726
NameBDBM50111726
Synonyms:CHEMBL19359 | N-(4-Carbamimidoyl-benzyl)-2-(6-methyl-2-oxo-3-phenethylamino-2H-pyrazin-1-yl)-acetamide
TypeSmall organic molecule
Emp. Form.C23H26N6O2
Mol. Mass.418.4915
SMILESCc1cnc(NCCc2ccccc2)c(=O)n1CC(=O)NCc1ccc(cc1)C(N)=N