Reaction Details
TargetProthrombin
LigandBDBM50111746
Substrate/Competitorn/a
Meas. Tech.ChEBML_208494
Ki 9.8±n/a nM
Citation Reiner, JESiev, DVAraldi, GLCui, JJHo, JZReddy, KMMamedova, LVu, PHLee, KSMinami, NKGibson, TSAnderson, SMBradbury, AENolan, TGSemple, JE Non-covalent thrombin inhibitors featuring P(3)-heterocycles with P(1)-monocyclic arginine surrogates. Bioorg Med Chem Lett12:1203-8 (2002) Prothrombin
Name:Prothrombin
Type:Protein
Mol. Mass.:70029.57
Organism:Homo sapiens (Human)
Description:P00734
Residue:622
BDBM50111746
NameBDBM50111746
Synonyms:CHEMBL282028 | N-(5-Amino-pyrazin-2-ylmethyl)-2-[3-(2,2-difluoro-2-phenyl-ethylamino)-6-methyl-2-oxo-2H-pyrazin-1-yl]-acetamide
TypeSmall organic molecule
Emp. Form.C20H21F2N7O2
Mol. Mass.429.4232
SMILESCc1cnc(NCC(F)(F)c2ccccc2)c(=O)n1CC(=O)NCc1cnc(N)cn1