Reaction Details
TargetTyrosine-protein kinase Lck
LigandBDBM26198
Substrate/Competitorn/a
Meas. Tech.ChEBML_221499
IC50>8000±n/a nM
Citation Thompson, JECubbon, RMCummings, RTWicker, LSFrankshun, RCunningham, BRCameron, PMMeinke, PTLiverton, NWeng, YDeMartino, JA Photochemical preparation of a pyridone containing tetracycle: a Jak protein kinase inhibitor. Bioorg Med Chem Lett12:1219-23 (2002) Tyrosine-protein kinase Lck
Name:Tyrosine-protein kinase Lck
Type:n/a
Mol. Mass.:57987.83
Organism:Homo sapiens (Human)
Description:P06239
Residue:509
BDBM26198
NameBDBM26198
Synonyms:4-tert-butyl-15-fluoro-3,5,10-triazatetracyclo[11.4.0.0^{2,6}.0^{7,12}]heptadeca-1(13),2(6),3,7(12),8,14,16-heptaen-11-one Compound # 2 PDK1 inhibitor, 1 | Tetracyclic Pyridone, 1
TypeSmall organic molecule
Emp. Form.C18H16FN3O
Mol. Mass.309.3375
SMILESCC(C)(C)c1nc2c([nH]1)c1ccc(F)cc1c1c2cc[nH]c1=O