Reaction Details
TargetDual specificity mitogen-activated protein kinase kinase 1/2
LigandBDBM26198
Substrate/Competitorn/a
Meas. Tech.ChEMBL_60727 (CHEMBL671987)
IC50 160±n/a nM
Citation Thompson, JECubbon, RMCummings, RTWicker, LSFrankshun, RCunningham, BRCameron, PMMeinke, PTLiverton, NWeng, YDeMartino, JA Photochemical preparation of a pyridone containing tetracycle: a Jak protein kinase inhibitor. Bioorg Med Chem Lett12:1219-23 (2002) Dual specificity mitogen-activated protein kinase kinase 1/2
Name:Dual specificity mitogen-activated protein kinase kinase 1/2
Type:n/a
Mol. Mass.:n/a
Description:ASSAY_ID of ChEMBL is 795758
Components:This complex has 2 components.
Component 1
Name:Dual specificity mitogen-activated protein kinase kinase 2
Synonyms:Dual specificity mitogen-activated protein kinase kinase 2 (MEK2) ERK activator kinase 2 MAP2K2 MAPKK 2 MKK2 PRKMK2 | VHL-MAP2K1/MAP2K2
Type:Enzyme Catalytic Domain
Mol. Mass.:44423.61
Organism:Homo sapiens (Human)
Description:gi_13489054
Residue:400
Component 2
Name:Dual specificity mitogen-activated protein kinase kinase 1
Synonyms:Dual specificity mitogen-activated protein kinase (MEK) Dual specificity mitogen-activated protein kinase kinase 1 (MEK1) Dual specificity mitogen-activated protein kinase kinase MEK1/2 MAP kinase kinase 1 MAPK/ERK kinase 1 MEK-1 MP2K1_HUMAN PRKMK1 | VHL-MAP2K1/MAP2K2
Type:Other Protein Type
Mol. Mass.:43439.03
Organism:Homo sapiens (Human)
Description:Full-length human MEK-1 was generated by PCR and purified as a fusion protein from Escherichia coli lysates.
Residue:393
BDBM26198
NameBDBM26198
Synonyms:4-tert-butyl-15-fluoro-3,5,10-triazatetracyclo[11.4.0.0^{2,6}.0^{7,12}]heptadeca-1(13),2(6),3,7(12),8,14,16-heptaen-11-one Compound # 2 PDK1 inhibitor, 1 | Tetracyclic Pyridone, 1
TypeSmall organic molecule
Emp. Form.C18H16FN3O
Mol. Mass.309.3375
SMILESCC(C)(C)c1nc2c([nH]1)c1ccc(F)cc1c1c2cc[nH]c1=O