Reaction Details
TargetCaspase-1
LigandBDBM50111802
Substrate/Competitorn/a
Meas. Tech.ChEBML_91006
Ki 90±n/a nM
Citation Lauffer, DJMullican, MD A practical synthesis of (S) 3-tert-butoxycarbonylamino-2-oxo-2,3,4,5-tetrahydro-1,5-benzodiazepine-1-acetic acid methyl ester as a conformationally restricted dipeptido-mimetic for caspase-1 (ICE) inhibitors. Bioorg Med Chem Lett12:1225-7 (2002) Caspase-1
Name:Caspase-1
Type:Enzyme
Mol. Mass.:45154.13
Organism:Homo sapiens (Human)
Description:P29466
Residue:404
BDBM50111802
NameBDBM50111802
Synonyms:1N-[2-hydroxy-5-oxo-(3S)-dihydro-3-furanyl]-2-[2-oxo-3-phenylcarboxamido-5-(3-phenylpropanoyl)-(3S)-2,5-dihydro-1H-benzo[b][1,4]diazepin-1-yl]acetamide | CHEMBL283789
TypeSmall organic molecule
Emp. Form.C31H30N4O7
Mol. Mass.570.5925
SMILESOC1OC(=O)C[C@@H]1NC(=O)CN1c2ccccc2N(C[C@H](NC(=O)c2ccccc2)C1=O)C(=O)CCc1ccccc1