Reaction Details
TargetBone morphogenetic protein 1
LigandBDBM50111824
Substrate/Competitorn/a
Meas. Tech.ChEMBL_158889 (CHEMBL760877)
IC50 36±n/a nM
Citation Dankwardt, SMAbbot, SCBroka, CAMartin, RLChan, CSSpringman, EBVan Wart, HEWalker, KA Amino acid derived sulfonamide hydroxamates as inhibitors of procollagen C-proteinase. Part 2: Solid-phase optimization of side chains. Bioorg Med Chem Lett12:1233-5 (2002) Bone morphogenetic protein 1
Name:Bone morphogenetic protein 1
Type:PROTEIN
Mol. Mass.:111254.03
Organism:Homo sapiens (Human)
Description:ChEMBL_518962
Residue:986
BDBM50111824
NameBDBM50111824
Synonyms:(R)-2-[Benzo[1,3]dioxol-5-ylmethyl-(4-methoxy-benzenesulfonyl)-amino]-N-hydroxy-3-(3-trityl-3H-imidazol-4-yl)-propionamide | CHEMBL20653
TypeSmall organic molecule
Emp. Form.C40H36N4O7S
Mol. Mass.716.801
SMILESCOc1ccc(cc1)S(=O)(=O)N(Cc1ccc2OCOc2c1)[C@H](Cc1cncn1C(c1ccccc1)(c1ccccc1)c1ccccc1)C(=O)NO