Reaction Details
TargetBone morphogenetic protein 1
LigandBDBM50111854
Substrate/Competitorn/a
Meas. Tech.ChEMBL_158889 (CHEMBL760877)
IC50 14±n/a nM
Citation Dankwardt, SMAbbot, SCBroka, CAMartin, RLChan, CSSpringman, EBVan Wart, HEWalker, KA Amino acid derived sulfonamide hydroxamates as inhibitors of procollagen C-proteinase. Part 2: Solid-phase optimization of side chains. Bioorg Med Chem Lett12:1233-5 (2002) Bone morphogenetic protein 1
Name:Bone morphogenetic protein 1
Type:PROTEIN
Mol. Mass.:111254.03
Organism:Homo sapiens (Human)
Description:ChEMBL_518962
Residue:986
BDBM50111854
NameBDBM50111854
Synonyms:CHEMBL21237 | {(R)-2-Amino-4-[benzo[1,3]dioxol-5-ylmethyl-(4-methoxy-benzenesulfonyl)-amino]-4-hydroxycarbamoyl-3-oxo-butyl}-carbamic acid benzyl ester
TypeSmall organic molecule
Emp. Form.C28H30N4O10S
Mol. Mass.614.624
SMILESCOc1ccc(cc1)S(=O)(=O)N(Cc1ccc2OCOc2c1)[C@@H](C(=O)NO)C(=O)C(N)CNC(=O)OCc1ccccc1