Reaction Details
TargetBone morphogenetic protein 1
LigandBDBM50111860
Substrate/Competitorn/a
Meas. Tech.ChEMBL_158889 (CHEMBL760877)
IC50 40±n/a nM
Citation Dankwardt, SMAbbot, SCBroka, CAMartin, RLChan, CSSpringman, EBVan Wart, HEWalker, KA Amino acid derived sulfonamide hydroxamates as inhibitors of procollagen C-proteinase. Part 2: Solid-phase optimization of side chains. Bioorg Med Chem Lett12:1233-5 (2002) Bone morphogenetic protein 1
Name:Bone morphogenetic protein 1
Type:PROTEIN
Mol. Mass.:111254.03
Organism:Homo sapiens (Human)
Description:ChEMBL_518962
Residue:986
BDBM50111860
NameBDBM50111860
Synonyms:(R)-N-Hydroxy-2-[(4-methoxy-benzenesulfonyl)-(3-phenoxy-thiophen-2-ylmethyl)-amino]-propionamide | CHEMBL20487
TypeSmall organic molecule
Emp. Form.C21H22N2O6S2
Mol. Mass.462.539
SMILESCOc1ccc(cc1)S(=O)(=O)N(Cc1sccc1Oc1ccccc1)[C@H](C)C(=O)NO