Reaction Details
TargetSodium-dependent serotonin transporter
LigandBDBM50111887
Substrate/Competitorn/a
Meas. Tech.ChEBML_202135
Ki 0.130000±n/a nM
Citation Davies, HMRen, PKong, NXSexton, TChilders, SR Synthesis of iodinated 3beta-aryltropanes with selective binding to either the dopamine or serotonin transporters. Bioorg Med Chem Lett12:845-7 (2002) Sodium-dependent serotonin transporter
Name:Sodium-dependent serotonin transporter
Type:Multi-pass membrane protein
Mol. Mass.:70168.43
Organism:Rattus norvegicus (rat)
Description:P31652
Residue:630
BDBM50111887
NameBDBM50111887
Synonyms:1-{3-[4-((Z)-2-Iodo-propenyl)-phenyl]-8-aza-bicyclo[3.2.1]oct-2-yl}-propan-1-one | CHEMBL355259
TypeSmall organic molecule
Emp. Form.C19H24INO
Mol. Mass.409.3044
SMILESCCC(=O)C1C2CCC(CC1c1ccc(\C=C(\C)I)cc1)N2