Reaction Details
TargetVoltage-dependent N-type calcium channel subunit alpha-1B
LigandBDBM50111940
Substrate/Competitorn/a
Meas. Tech.ChEBML_141440
IC50 140±n/a nM
Citation Seko, TKato, MKohno, HOno, SHashimura, KTakimizu, HNakai, KMaegawa, HKatsube, NToda, M Structure-activity study of L-cysteine-based N-type calcium channel blockers: optimization of N- and C-terminal substituents. Bioorg Med Chem Lett12:915-8 (2002) Voltage-dependent N-type calcium channel subunit alpha-1B
Name:Voltage-dependent N-type calcium channel subunit alpha-1B
Type:Enzyme
Mol. Mass.:262548.16
Organism:Homo sapiens (Human)
Description:Q00975
Residue:2339
BDBM50111940
NameBDBM50111940
Synonyms:(R)-4-[(R)-2-Cyclohexylmethylsulfanyl-1-(4-phenoxy-benzylcarbamoyl)-ethylcarbamoyl]-thiazolidine-3-carboxylic acid tert-butyl ester | CHEMBL74345
TypeSmall organic molecule
Emp. Form.C32H43N3O5S2
Mol. Mass.613.831
SMILESCC(C)(C)OC(=O)N1CSC[C@H]1C(=O)N[C@@H](CSCC1CCCCC1)C(=O)NCc1ccc(Oc2ccccc2)cc1