Reaction Details
TargetVoltage-dependent N-type calcium channel subunit alpha-1B
LigandBDBM50111945
Substrate/Competitorn/a
Meas. Tech.ChEBML_141440
IC50 200±n/a nM
Citation Seko, TKato, MKohno, HOno, SHashimura, KTakimizu, HNakai, KMaegawa, HKatsube, NToda, M Structure-activity study of L-cysteine-based N-type calcium channel blockers: optimization of N- and C-terminal substituents. Bioorg Med Chem Lett12:915-8 (2002) Voltage-dependent N-type calcium channel subunit alpha-1B
Name:Voltage-dependent N-type calcium channel subunit alpha-1B
Type:Enzyme
Mol. Mass.:262548.16
Organism:Homo sapiens (Human)
Description:Q00975
Residue:2339
BDBM50111945
NameBDBM50111945
Synonyms:(R)-3-(2-Methoxy-ethyl)-thiazolidine-4-carboxylic acid [(R)-2-cyclohexylmethylsulfanyl-1-(4-phenoxy-benzylcarbamoyl)-ethyl]-amide | CHEMBL554925
TypeSmall organic molecule
Emp. Form.C30H41N3O4S2
Mol. Mass.571.794
SMILESCOCCN1CSC[C@H]1C(=O)N[C@@H](CSCC1CCCCC1)C(=O)NCc1ccc(Oc2ccccc2)cc1