Reaction Details
TargetCoagulation factor X
LigandBDBM50111955
Substrate/Competitorn/a
Meas. Tech.ChEMBL_49330 (CHEMBL660847)
Ki 10±n/a nM
Citation He, WHanney, BMyers, MRCondon, SBecker, MRSpada, APBurns, CBrown, KColussi, DChu, V Benzimidazoles and isosteric compounds as potent and selective factor Xa inhibitors. Bioorg Med Chem Lett12:919-22 (2002) Coagulation factor X
Name:Coagulation factor X
Type:Enzyme
Mol. Mass.:54726.60
Organism:Homo sapiens (Human)
Description:n/a
Residue:488
BDBM50111955
NameBDBM50111955
Synonyms:1-(4-Amino-quinazolin-7-ylmethyl)-4-(6-chloro-1H-benzoimidazol-2-ylmethyl)-piperazin-2-one | CHEMBL354996
TypeSmall organic molecule
Emp. Form.C21H20ClN7O
Mol. Mass.421.883
SMILESNc1ncnc2cc(CN3CCN(Cc4nc5ccc(Cl)cc5[nH]4)CC3=O)ccc12