Reaction Details
TargetCoagulation factor X
LigandBDBM50111956
Substrate/Competitorn/a
Meas. Tech.ChEBML_49330
Ki 390±n/a nM
Citation He, WHanney, BMyers, MRCondon, SBecker, MRSpada, APBurns, CBrown, KColussi, DChu, V Benzimidazoles and isosteric compounds as potent and selective factor Xa inhibitors. Bioorg Med Chem Lett12:919-22 (2002) Coagulation factor X
Name:Coagulation factor X
Type:Enzyme
Mol. Mass.:54726.60
Organism:Homo sapiens (Human)
Description:n/a
Residue:488
BDBM50111956
NameBDBM50111956
Synonyms:1-(4-Amino-quinazolin-7-ylmethyl)-4-(6-chloro-1H-indol-2-ylmethyl)-piperazin-2-one | CHEMBL367072
TypeSmall organic molecule
Emp. Form.C22H21ClN6O
Mol. Mass.420.895
SMILESNc1ncnc2cc(CN3CCN(Cc4cc5ccc(Cl)cc5[nH]4)CC3=O)ccc12